COHORT,#DONOR/PATIENT,HMWK (ng/mL),KLKB1 (ng/mL),BK (pg/mL),CPN1 (pg/mL),DA9B (ng/mL),ACE2 (pg/mL),C1INH (ng/mL),BR1 mRNA relative expression,IL-1b (pg/mL),IL-6 (pg/mL),TNF-α (pg/mL),TF (pg/mL),CD40L (ng/mL),GSDMD (ng/mL),AGE (years),SEX (0=male),Duration Hospital Stay (days),Mechanical Ventilation (1=True),UCI admission (1=True),Exitus (1=True),C-reactive protein (mg/L),Ferritin (mg/L),D-Dimer (ng/mL),Fibrinogen (mg/dL),Lymphocyte count (x10^3),Monocyte count (x10^3)
COVID,1,80180.5853545,14.8643456724,7.187711365669206,373.1889706695394,6.156840000000001,24.26855125,4987.943529371814,,39.0839259140794,0.19298723728299172,0.4956516194126246,141.05683,1.6865388000000001,1.7054019999999999,>60,0.0,>30,0.0,1.0,1.0,,1608.0,,,0.38,0.22
COVID,2,73674.4715625,13.379061826900001,8.559971340584763,603.897761841072,5.754864,23.67357509,5168.7491040855975,,90.87305989569401,1.1130256371769645,0.7785362945097964,109.16861000000002,0.33976900000000004,0.9940889999999997,50-60,0.0,<10,0.0,0.0,0.0,,1313.0,380.0,,0.68,0.29
COVID,3,72819.9265305,12.5969331136,11.525999380758897,423.24960835804404,5.754864,23.463375560000003,20971.674763433053,0.225582,47.58870838226624,0.0656728964931802,0.5114824386886754,126.33919000000003,0.504375,0.48409100000000005,50-60,1.0,<10,0.0,0.0,0.0,,471.0,440.0,1035.0,0.52,0.19
COVID,4,114534.6678625,11.7608267344,23.315206129252953,257.09665294495755,7.094784000000001,22.633924210000004,17139.739358926425,,127.35022387563745,20.857274632085755,1.7574845414517921,104.61315,0.466389,0.7256689999999998,50-60,0.0,10-20,0.0,0.0,0.0,97.7,1616.0,320.0,762.0,1.54,0.32
COVID,5,106592.91773049999,12.26965725,4.589938816244523,234.57423282748772,5.665536,24.34644596,56835.93058516282,,153.87516429011941,2.811659222910173,1.4716117300111418,145.43708000000004,1.0551720000000002,0.913563,30-40,0.0,10-20,0.0,0.0,0.0,84.4,791.0,250.0,790.0,0.94,0.25
COVID,6,15424.2207625,7.4209803589000005,2.844201889574294,237.27791605070422,5.8888560000000005,22.875049250000004,262767.5251423251,,0.39040042166593314,,0.4176603597146382,98.30559,0.33607240000000005,0.819616,>60,0.0,20-30,1.0,1.0,1.0,56.0,214.0,520.0,439.0,1.04,0.33
COVID,7,53525.260574500004,16.0437391525,51.05342716357438,170.18602367378497,5.576208,22.93728756,17973.091207581892,,64.78724706528004,3.7534135545353537,16.93118011498962,113.54885999999999,0.5281112,0.443828,50-60,1.0,<10,0.0,0.0,0.0,1.1,68.0,220.0,323.0,2.26,0.37
COVID,8,8635.285262500001,13.426946154100001,1.4680999931449086,505.6146991683437,5.129568,23.39487469,14689.055702375275,0.785324,1.0066848355758178,,,82.53669000000002,0.44757879999999994,0.2559339999999999,>60,1.0,<10,0.0,0.0,0.0,52.1,406.0,670.0,768.0,1.6,0.55
COVID,9,31252.4338105,9.814010082100001,35.767606702877735,301.8936838409041,4.7275920000000005,23.817622210000003,4813.46262919519,1.307541,116.84676660598538,2.0306333728645023,1.5822259946384425,121.2581,0.289121,1.3698769999999998,>60,0.0,20-30,0.0,0.0,0.0,21.5,358.0,310.0,430.0,0.84,0.42
COVID,10,40205.5423905,12.761584478100001,31.626760431959042,,6.514152,23.817622210000003,,2.968,532.8199239779875,7.333612542660059,12.629271971368881,131.7707,0.35876199999999997,1.343035,50-60,1.0,10-20,0.0,0.0,0.0,33.3,334.0,350.0,463.0,0.79,0.4
COVID,11,44206.4897625,12.060692702099999,2.4775757340196276,319.69739735413714,6.737472,24.34644596,4482.597629733001,7.537071,1546.4780576772673,50.07164844888601,27.070102119979264,109.16861000000002,0.5486920000000002,0.9538259999999997,>60,1.0,<10,0.0,0.0,0.0,122.3,73.0,860.0,687.0,0.52,0.25
COVID,12,63634.301930500005,11.737856638899999,31.626760431959042,,9.193992,24.830253440000003,,0.819503,1940.8719369254077,120.53295528704845,84.70730236119088,137.37742000000003,0.5613540000000001,1.302772,50-60,0.0,20-30,0.0,0.0,0.0,152.9,487.0,280.0,897.0,0.71,0.15
COVID,13,104677.74329050002,14.127466694399999,12.945384200098182,184.40088227676236,12.007824,22.633924210000004,12739.08347039647,0.911867,,,,141.75767,3.3777192000000005,1.9604010000000005,>60,0.0,10-20,0.0,0.0,0.0,163.6,389.0,980.0,760.0,0.43,0.3
COVID,14,115355.44975450002,13.021687368400002,80.86125641492617,179.192759597398,6.067512000000001,22.93728756,181877.01310025246,,12.665177745701683,,0.5396515911946826,24.542180000000002,1.5996380000000001,0.5377749999999998,30-40,0.0,<10,0.0,0.0,0.0,80.9,841.0,2000.0,891.0,1.0,0.35
COVID,15,95562.72313050002,14.420729159999999,85.50579144926525,142.48861413254065,6.469488000000001,24.42512349,19530.13595990345,0.428213,9.57230688572495,1.4383880675760654,1.0523462483240584,45.04175,1.6376240000000002,0.765932,<30,1.0,<10,0.0,0.0,0.0,131.0,231.0,480.0,873.0,1.41,0.31
COVID,16,55266.5212705,8.9964233469,44.448322287937664,390.6941055813894,5.8888560000000005,24.58482701,16152.17485355697,,93.12316792518466,8.030511038644349,32.96574194453419,89.01946000000001,0.47905100000000006,1.3564559999999997,40-50,0.0,<10,0.0,0.0,0.0,24.8,1829.0,130.0,702.0,0.62,0.17
COVID,17,52296.82705450001,13.667195082099997,0.02574730845936948,310.6680302213115,6.246168000000001,23.96480061,4870.934006349198,2.968156,1493.699748014909,72.04685277323459,1025.98164622895,180.82950000000002,0.4727200000000001,1.1282989999999997,40-50,0.0,10-20,0.0,0.0,0.0,31.6,1616.0,410.0,661.0,0.62,0.73
COVID,18,73199.1567625,15.6388240261,85.50579144926525,209.21342750226026,4.414944,24.665853000000002,34936.76476697223,18.176899,53.50167078939632,1.2698512558503046,1.8857308851886396,129.14255000000003,1.1311440000000001,0.6854059999999998,>60,0.0,<10,0.0,0.0,0.0,91.5,434.0,220.0,,0.96,0.39
COVID,19,68892.8353905,13.092914072500001,10.307755263625374,272.2585307822406,5.620872,23.745207240000003,117234.67632448948,5.203047,,1.1236041175331413,,168.21438,1.4201624,1.9469800000000004,>60,0.0,<10,0.0,0.0,0.0,65.8,927.0,,1043.0,0.6,0.22
COVID,20,71687.6844105,10.606931818900001,29.217140599628742,183.34728665548653,5.442216,24.58482701,18624.58917784448,,43.512172675217805,,,174.87236000000001,0.9032280000000001,0.7122479999999999,>60,0.0,10-20,0.0,0.0,0.0,38.7,1290.0,400.0,534.0,0.79,0.48
COVID,21,49241.9487625,14.4943550109,9.015920888584931,214.02484270530306,8.16672,23.463375560000003,79241.54397685392,0.177472,178.73942695498997,12.931209829960935,23.72646302821856,238.99922000000004,0.30811400000000005,0.913563,>60,0.0,10-20,0.0,0.0,0.0,174.8,882.0,2760.0,1032.0,0.95,0.19
COVID,22,81273.10161449999,12.738021490000001,76.548878255851,912.129609532389,6.156840000000001,24.665853000000002,17761.0295573793,18.602,296.69339911306974,31.003538494479873,42.61746906882449,45.9178,0.7386220000000001,1.383298,<30,1.0,<10,0.0,0.0,0.0,5.3,58.0,600.0,505.0,0.6,0.11
COVID,23,70377.0648625,8.700226086099999,37.308844678888406,280.222775926075,4.906248000000001,22.46130004,11585.133790986289,0.796763,0.6319718911648684,,,47.144270000000006,0.3524310000000001,-0.10643300000000006,40-50,1.0,<10,0.0,0.0,0.0,,426.0,720.0,,0.96,0.43
COVID,24,122021.82247450002,7.848337446400001,38.94047122582918,307.07195329896246,4.682928,25.790427490000003,10288.56111213897,1.311895,36.035456585260604,0.9366928092948819,0.6503571335461491,68.34468,0.7639460000000002,0.48409100000000005,50-60,0.0,<10,0.0,0.0,0.0,,1631.0,1000.0,,0.76,0.27
COVID,25,20055.950930500003,17.0195592709,9.015920888584931,141.67448906937318,5.129568,24.747661810000004,21731.86695205444,4.818112,8.343473425248785,,,92.34845,0.7069670000000001,0.7525109999999998,>60,0.0,<10,0.0,0.0,0.0,47.7,2282.0,1760.0,507.0,0.98,0.6
COVID,26,71875.82387050001,13.9815800244,35.767606702877735,170.18602367378497,8.032728,,15041.916036583694,,24.711408691912656,1.445755664016427,,100.05769000000001,2.289717,1.2759299999999998,50-60,1.0,10-20,0.0,0.0,0.0,43.2,15.0,520.0,448.0,1.3,0.31
COVID,27,88282.80471450002,16.7608341549,2.698693212897734,205.61019022258063,8.836680000000001,24.039564040000002,11863.431747244682,,,1.458107553760894,,136.711236,1.3653910000000002,0.9940889999999997,50-60,0.0,10-20,0.0,0.0,0.0,62.8,,,441.0,1.5,0.33
COVID,28,19621.2266905,10.763186169599999,12.569480679404833,269.2054694893241,4.504272,23.128699410000003,14007.973545544419,0.049105,1.712922626827325,,,79.4793,0.25746600000000003,0.8464579999999999,40-50,0.0,<10,0.0,0.0,0.0,26.5,193.0,710.0,722.0,1.55,0.39
COVID,29,37983.47826250001,14.3227543936,62.07924945616465,312.45326785576106,4.280952,23.602725760000002,4482.597629733001,0.121233,2.849993063446649,,,87.26208399999999,0.5993400000000002,0.6048800000000001,50-60,0.0,<10,0.0,0.0,0.0,80.1,689.0,410.0,,0.97,0.35
COVID,30,51161.810570500005,11.898936859600001,24.18006660940783,384.0354688550658,5.754864,24.11511029,4429.708171844176,0.149641,,,,137.565444,0.5095268,1.1819829999999998,>60,0.0,<10,0.0,0.0,0.0,36.4,481.0,,466.0,13.96,0.41
COVID,31,32170.5288625,10.8527777104,37.308844678888406,165.37937807283836,5.26356,23.06411264,23896.492873061878,0.040909,,,,83.845252,0.751124,2.0140849999999997,40-50,1.0,<10,0.0,0.0,0.0,9.6,30.0,100.0,424.0,1.04,0.26
COVID,32,58309.7712625,10.517946958900001,53.546397605343905,171.16398878369117,5.576208,23.67357509,37963.4064067008,0.025018,4.427626293662483,,0.2931475345708062,71.316868,0.7766080000000002,1.061194,50-60,0.0,<10,0.0,0.0,0.0,110.0,1071.0,290.0,894.0,0.76,0.24
COVID,33,70004.6453505,15.0629425396,40.66923593194591,148.319999091487,6.246168000000001,24.747661810000004,127390.95024826274,0.28471,7.671302421228514,0.1552641604988788,3.0800909716883966,150.28365200000002,0.9222210000000002,2.430136,>60,0.0,<10,0.0,0.0,0.0,131.6,576.0,460.0,1004.0,0.55,0.36
COVID,34,34786.7366905,14.740670746900001,62.07924945616465,229.2589373835833,5.48688,23.327156640000002,31026.749095041414,1.224402,,,,83.08595600000001,0.23214200000000013,1.155141,>60,0.0,10-20,0.0,0.0,0.0,26.7,4849.0,,645.0,0.67,0.41
COVID,35,38267.131390500006,17.1754561741,53.546397605343905,266.1379850661177,6.201504000000001,24.504583840000002,11723.456999198821,0.088083,1.2423340945014194,,9.12699779381827,69.79827599999999,0.5993400000000002,0.457249,40-50,0.0,<10,0.0,0.0,0.0,23.0,516.0,380.0,769.0,1.73,0.24
COVID,36,77918.42477049999,16.1200537024,55.44111962714755,307.1280971534588,5.352888,24.514375705,4482.597629733001,0.757117,11.207507603627402,1.7786195728078593,1.2360476245524041,78.48408999999998,1.2261090000000001,1.1282989999999997,50-60,0.0,<10,0.0,0.0,0.0,8.9,116.0,610.0,505.0,1.1,0.28
COVID,37,69725.92665450001,12.738021490000001,48.07357992165793,195.31134281622533,4.504272,24.882237519999997,4429.708171844176,4.283543,4.351684868059682,0.367926851841469,1.6724815487845466,71.42183999999999,0.6373260000000001,1.5044960000000003,>60,1.0,20-30,0.0,0.0,0.0,22.2,81.0,640.0,526.0,0.85,0.26
COVID,38,79193.3481345,12.550013960400001,10.732572814344023,217.77554344235557,5.978184000000001,25.13909488,61031.04727771618,,18.25589747058973,9.201273688643724,10.959971635949108,84.18375999999998,0.5613540000000001,2.15992,>60,1.0,10-20,0.0,0.0,0.0,67.3,310.0,320.0,635.0,0.66,0.16
COVID,39,55099.608554499995,13.6190349909,86.45916323195516,181.25812053668608,4.861584000000001,25.092229919999998,33714.65827560865,2.372,3.9265167992939363,0.5457325270834881,5.2904937030510375,79.31407999999999,0.2954520000000001,1.757728,>60,1.0,10-20,0.0,0.0,0.0,86.2,1196.0,990.0,683.0,0.71,0.22
COVID,40,78701.8578745,13.259592302400002,75.22009600420205,162.56080163444122,6.558816,25.092229919999998,73794.68473538762,,,1.5924892559481352,8.13865711145011,108.86799999999998,0.39674800000000005,2.055648,40-50,1.0,10-20,0.0,0.0,0.0,82.0,165.0,170.0,538.0,0.53,0.14
COVID,41,1422.2823625,12.950584758100002,14.491510477364487,138.4642397713536,7.362768000000001,25.51257008,98115.2400264423,7.596,15.670658227667872,157.52933769909671,404.9499275287939,75.70379999999999,0.4042152,5.258288,>60,1.0,10-21,0.0,0.0,1.0,14.2,18.0,560.0,468.0,1.32,0.94
COVID,42,10407.4645945,17.830369531600002,57.57228159642567,130.00619402831558,6.246168000000001,25.092229919999998,46450.89376220411,0.87654,,,13.656961945682767,84.43563999999999,0.2954520000000001,3.023888,50-60,0.0,10-22,0.0,0.0,0.0,15.1,215.0,420.0,445.0,1.12,0.31
COVID,43,49400.688614499995,18.25403661,51.5508889075234,178.1689211832586,7.496760000000001,26.109548,56165.33246203055,,,1.4810097860984388,77.30518819113837,67.89551999999999,0.4347340000000001,2.025856,50-60,0.0,10-23,0.0,0.0,0.0,188.9,1495.0,1380.0,694.0,0.6,0.05
COVID,44,70283.87485050001,19.491741433599998,20.664184398935575,127.79048612323135,5.665536,25.89595592,38875.36293704417,38.178,38.857305391903274,1.2354763833994191,10.571866181872544,121.12615999999997,1.0113055999999998,2.2344,50-60,0.0,10-24,0.0,0.0,0.0,91.6,1636.0,420.0,796.0,0.88,0.41
COVID,45,36092.5720345,11.57745204,44.95502738904079,301.8936838409041,7.094784000000001,26.580530479999997,5047.498158935304,,,,,61.655695,0.8068772000000001,0.86435,50-60,0.0,,0.0,0.0,0.0,61.5,1034.0,340.0,758.0,0.4,
COVID,46,69077.56949050001,7.909884834100001,6.071070005993461,517.3372149294809,7.452096000000001,25.69696328,52304.672449396254,,2.659080495,825.78,,134.83388999999997,0.18149400000000004,2.7922903200000007,>60,0.0,,0.0,0.0,0.0,46.4,1438.0,230.0,484.0,0.8,
COVID,47,122988.69097050001,11.1907108069,67.5270623243264,229.2589373835833,5.620872,25.397752079999997,53561.13471457587,1.678595,2.526547866,4.855783579,,82.993962,0.4727200000000001,0.9530330400000002,<30,0.0,<10,0.0,0.0,0.0,89.2,1295.0,590.0,888.0,1.05,0.28
COVID,48,89842.40949450001,10.942589862399998,57.57228159642567,196.3977806477256,5.308224,25.092229919999998,30660.669407494923,,2.526547866,18.03484777,,67.311792,0.5219164,1.0205287200000002,50-60,1.0,,0.0,0.0,0.0,,,,,,
COVID,49,,5.626014800000002,4.929103926623968,197.4411108,6.616409999999999,25.003366479999997,136793.80327388438,3.224711,,,,92.057435,0.47235800000000006,0.9751500000000002,50-60,0.0,>30,1.0,1.0,0.0,43.7,158.0,,309.0,0.83,0.17
COVID,50,,7.682411120000001,30.708173291540653,247.5676098,4.0877509,25.092229919999998,37072.84298115191,1.080252,,,,101.6951,0.4537736,1.0997999999999999,50-60,0.0,>31,1.0,1.0,1.0,,878.0,,,0.67,0.22
COVID,51,,13.851600079999997,2.1225205602442507,300.4789143,5.906112499999999,25.34277632,27030.31,0.239302,,,,71.685135,0.813072,0.2965,<30,0.0,>32,1.0,1.0,0.0,86.8,1298.0,3440.0,275.0,0.83,0.34
COVID,52,,12.137936480000004,23.25946878071583,222.50436029999995,9.3155405,25.51257008,27255.82,0.385141,,,,96.05354000000001,0.6148384,1.0166999999999997,40-50,0.0,>33,1.0,1.0,0.0,45.8,902.0,2320.0,1114.0,0.43,0.28
COVID,53,,13.080451459999999,1.2123488050349094,124.1078993,5.764053,28.121983919999998,25526.91,0.18017,,,,135.309395,0.8192667999999999,2.9418499999999996,40-50,0.0,>34,1.0,1.0,0.0,44.8,270.0,,765.0,0.44,0.18
COVID,54,,10.338589700000002,24.614844484344015,229.00223979999996,11.5600806,25.572412319999998,27932.35,,,,,90.176915,1.9900840000000002,5.5595,40-50,0.0,20-30,1.0,1.0,0.0,46.3,379.0,460.0,694.0,0.72,0.11
COVID,55,,15.650946860000005,4.737550793391511,257.7785633,15.13998,25.092229919999998,31164.660000000003,,,,,120.108525,1.4821103999999998,6.7921499999999995,50-60,0.0,>30,1.0,1.0,0.0,198.8,793.0,1680.0,987.0,0.39,0.24
COVID,56,,13.423184179999996,36.22900607113217,165.87998179999997,11.503256799999999,25.187582,30262.620000000003,,,,,109.5306,2.7768236,3.68975,40-50,0.0,<10,1.0,1.0,0.0,273.9,,2140.0,942.0,1.47,0.5
COVID,57,,8.79629246,44.95502738904079,239.2131933,21.731540799999998,27.10991072,47005.50424538443,,,,,133.115455,1.7732659999999998,11.58425,50-60,0.0,20-30,1.0,1.0,1.0,71.3,1690.0,800.0,850.0,0.61,0.2
COVID,58,,11.623837400000003,13.675363975828203,220.64782329999997,15.935513199999999,25.63387672,74675.77231933708,,,,,103.96739500000001,1.5998116,7.5262,50-60,0.0,>30,1.0,1.0,0.0,28.4,1672.0,370.0,,0.85,0.71
COVID,59,,9.653124260000002,25.489442180403174,174.23439829999998,11.6169044,25.092229919999998,72063.57434657784,,,,,96.288605,1.8228243999999998,2.8864500000000004,50-60,1.0,20-30,1.0,1.0,0.0,221.0,1452.0,1470.0,558.0,0.65,0.21
COVID,60,,14.02296644,16.375936546095804,317.1877473,15.452510899999998,25.23769128,227885.13461462976,,,,,128.02238,0.5281112,5.0055,50-60,0.0,>30,1.0,1.0,0.0,55.0,1615.0,2180.0,1400.0,0.59,0.23
COVID,61,,13.594550539999998,16.525296892867495,280.98527579999995,8.2358883,25.51257008,26053.100000000006,,,,,115.720645,1.6369804000000001,3.0110999999999994,40-50,0.0,>30,1.0,1.0,0.0,11.1,1157.0,2020.0,1400.0,0.79,0.12
COVID,62,,9.56744108,15.940504663749817,179.8040093,20.850771899999998,25.761671999999997,24850.38,,,,,128.33579999999998,2.26885,7.09685,50-60,0.0,20-30,1.0,1.0,0.0,49.8,1304.0,1880.0,749.0,0.9,0.36
COVID,63,,14.794115059999998,22.019054062468445,234.57423282748772,5.423110199999999,24.961368,26654.46,,,,,124.41805,0.8006824,0.69815,40-50,0.0,20-30,1.0,1.0,0.0,41.4,1410.0,,,1.17,0.45
HC,1,45041.7878,16.5291604,82.43173160915482,249.83534870140383,5.442216,25.572412319999998,33316.86437430546,,,,,,,,,,,,,,,,,,,
HC,2,46810.5118,18.6008652,143.0233932135245,206.79171845820295,4.548936,25.289422719999997,28894.050430180116,0.097178,,,,,,,,,,,,,,,,,,
HC,3,27197.0908,16.7092546,95.51724621173223,181.25812053668608,5.978184,27.20381832,7646.956354068098,0.036129,,,,,,,,,,,,,,,,,,
HC,4,39699.0185,13.0216874,106.18390464040192,258.5740454536149,6.648144,27.3965,5683.587903465875,,,,,,,,,,,,,,,,,,,
HC,5,21381.918,16.2730551,82.43173160915482,334.6934087893385,6.335496,26.03672848,8610.631894015522,,,,,,,,,,,,,,,,,,,
HC,6,29576.9133,13.1642649,93.1157350212573,263.10545335284127,7.094784,25.572412319999998,48134.66995036435,,,,,,,,,,,,,,,,,,,
HC,7,12417.328,11.623213,223.02182013432073,*458.685557383181,6.8268,25.34277632,31026.749095041414,0.101797,,,,,,,,,,,,,,,,,,
HC,8,19136.5038,9.74873988,189.7829189908608,278.6216909092781,4.772256,25.63387672,58896.148996484204,0.317324,,,,,,,,,,,,,,,,,,
HC,9,105239.327,15.2124693,147.80426291708565,200.95120063903954,6.246168,26.497978,41252.25205061921,,,,,,,,,,,,,,,,,,,
HC,10,21047.3614,11.0326226,40.218447808214314,181.25812053668608,5.442216,25.51257008,41744.79222776186,,,,,,,,,,,,,,,,,,,
HC,11,40133.0116,18.950024,104.33260370052062,167.28552711816144,6.692808,24.775707999999998,1622.7163119658123,,,,,,,,,,,,,,,,,,,
HC,12,9048.15176,11.7838106,95.51724621173223,184.40088227676236,4.950912,25.04698712,85090.44132855457,,,,,,,,,,,,,,,,,,,
HC,13,3885.62953,11.8068083,58.68444888895722,115.26710596157743,6.648144,26.926962,43356.57882026019,,,,,,,,,,,,,,,,,,,
HC,14,33501.3903,17.1754562,106.18390464040192,124.89483905885544,7.764744,25.96553112,20971.674763433053,,,,,,,,,,,,,,,,,,,
HC,15,55852.5036,16.6834855,138.48387560739152,119.29889845907178,4.504272,24.92099168,17551.469988925885,0.039672,,,,,,,,,,,,,,,,,,
HC,16,19351.3686,15.1875137,147.41559793298424,153.50790985385805,5.531544,24.961368,44702.87674501424,0.039778,,,,,,,,,,,,,,,,,,
HC,17,30797.5579,13.5709301,88.59156502721552,117.93953710054116,4.772256,25.092229919999998,24181.810213272627,0.037802,,,,,,,,,,,,,,,,,,
HC,18,54766.4642,13.4748856,36.75943486979731,117.2656760087166,8.568696,25.04698712,31397.199670119837,0.352691,,,,,,,,,,,,,,,,,,
HC,19,65877.4993,17.2014873,138.48387560739152,82.2022024658963,6.067512,25.89595592,50475.02737048265,0.323061,,,,,,,,,,,,,,,,,,
HC,20,12234.0195,12.137936480000004,49.76396334924427,186.5262716076726,6.4175267,24.961368,29360.58,1.559132,,,,,,,,,,,,,,,,,,
HC,21,,11.024055140000003,57.57228159642567,119.46655679999998,4.2582223,25.289422719999997,36351.39,0.144617,,,,,,,,,,,,,,,,,,
HC,22,,12.394986020000001,57.57228159642567,128.7492418,5.508345899999999,25.572412319999998,18846.961484733525,0.058413,,,,,,,,,,,,,,,,,,
HC,23,,8.88197564,39.60683500798185,138.0319268,4.428693699999999,26.926962,36877.58,0.036949,,,,,,,,,,,,,,,,,,
HC,24,,13.68023372,28.793137030818915,112.9686773,6.4175267,25.289422719999997,30563.300000000003,0.037475,,,,,,,,,,,,,,,,,,
HC,25,,11.966570120000002,64.79486739010815,143.60153780000002,3.9741032999999995,25.454349999999998,42214.65,0.106422,,,,,,,,,,,,,,,,,,
HC,26,,10.509956060000002,93.1157350212573,199.2976478,6.019760099999999,26.497978,28233.03,0.559615,,,,,,,,,,,,,,,,,,
HC,27,,11.795203760000001,42.146351848542466,97.1881128,3.7752199999999996,25.397752079999997,26504.120000000003,,,,,,,,,,,,,,,,,,,
